H5W3
当前位置:H5W3 > 问答 > 正文

使用maven创建ssm项目运行时出现下面问题

[ERROR] COMPILATION ERROR :
[INFO] ————————————————————-
[ERROR] No compiler is provided in this environment. Perhaps you are running on a JRE rather than a JDK?
[INFO] 1 error
[INFO] ————————————————————-
[INFO] ————————————————————————
[INFO] BUILD FAILURE
[INFO] ————————————————————————
[INFO] Total time: 2.369 s
[INFO] Finished at: 2020-10-13T15:15:15+08:00
[INFO] ————————————————————————
[ERROR] Failed to execute goal org.apache.maven.plugins:maven-compiler-plugin:3.8.0:compile (default-compile) on project SSMStudy01: Compilation failure
[ERROR] No compiler is provided in this environment. Perhaps you are running on a JRE rather than a JDK?
[ERROR]
[ERROR] -> [Help 1]
[ERROR]
[ERROR] To see the full stack trace of the errors, re-run Maven with the -e switch.
[ERROR] Re-run Maven using the -X switch to enable full debug logging.
[ERROR]
[ERROR] For more information about the errors and possible solutions, please read the following articles:
[ERROR] [Help 1] http://cwiki.apache.org/confluence/display/MAVEN/MojoFailureException

回答

maven项目启动需要jdk 而非JRE;你的开发工具没指定安装的jdk

未经允许不得转载:H5W3 » 使用maven创建ssm项目运行时出现下面问题

赞 (0)

评论 0

  • 昵称 (必填)
  • 邮箱 (必填)
  • 网址